Reaction Details
TargetAlkaline phosphatase, tissue-nonspecific isozyme
LigandBDBM50068220
Substrate/Competitorn/a
Meas. Tech.ChEMBL_1464323 (CHEMBL3404590)
IC50 613±n/a nM
Citation Al-Rashida, MEjaz, SAAli, SShaukat, AHamayoun, MAhmed, MIqbal, J Diarylsulfonamides and their bioisosteres as dual inhibitors of alkaline phosphatase and carbonic anhydrase: Structure activity relationship and molecular modelling studies. Bioorg Med Chem23:2435-44 (2015) 
 
Alkaline phosphatase, tissue-nonspecific isozyme
Name:Alkaline phosphatase, tissue-nonspecific isozyme
Type:Protein
Mol. Mass.:57195.60
Organism:Bos taurus (Cattle)
Description:P09487
Residue:524
BDBM50068220
NameBDBM50068220
Synonyms:CHEMBL3403320
TypeSmall organic molecule
Emp. Form.C14H13FN2O3S
Mol. Mass.308.328
SMILESNS(=O)(=O)c1ccc(CNC(=O)c2ccc(F)cc2)cc1