Reaction Details
TargetAlkaline phosphatase, tissue-nonspecific isozyme
LigandBDBM50428400
Substrate/Competitorn/a
Meas. Tech.ChEMBL_1464323 (CHEMBL3404590)
IC50 180±n/a nM
Citation Al-Rashida, MEjaz, SAAli, SShaukat, AHamayoun, MAhmed, MIqbal, J Diarylsulfonamides and their bioisosteres as dual inhibitors of alkaline phosphatase and carbonic anhydrase: Structure activity relationship and molecular modelling studies. Bioorg Med Chem23:2435-44 (2015) 
 
Alkaline phosphatase, tissue-nonspecific isozyme
Name:Alkaline phosphatase, tissue-nonspecific isozyme
Type:Protein
Mol. Mass.:57195.60
Organism:Bos taurus (Cattle)
Description:P09487
Residue:524
BDBM50428400
NameBDBM50428400
Synonyms:CA inhibitor, 2 [(4-Methylphenyl)Sulfonyl]Phenylamine
TypeSmall organic molecule
Emp. Form.C13H13NO2S
Mol. Mass.247.313
SMILESCc1ccc(cc1)S(=O)(=O)Nc1ccccc1