Reaction Details
TargetCholinesterase
LigandBDBM50068350
Substrate/Competitorn/a
Meas. Tech.ChEMBL_1466467 (CHEMBL3406577)
IC50 2.0±n/a nM
Citation Wieckowska, AWieckowski, KBajda, MBrus, BSalat, KCzerwinska, PGobec, SFilipek, BMalawska, B Synthesis of new N-benzylpiperidine derivatives as cholinesterase inhibitors withß-amyloid anti-aggregation properties and beneficial effects on memory in vivo. Bioorg Med Chem23:2445-57 (2015) 
 
Cholinesterase
Name:Cholinesterase
Type:Enzyme
Mol. Mass.:65643.35
Organism:Equus caballus (Horse)
Description:P81908
Residue:574
BDBM50068350
NameBDBM50068350
Synonyms:CHEMBL3402303
TypeSmall organic molecule
Emp. Form.C23H29N3
Mol. Mass.347.4965
SMILESC(CNC1CCN(Cc2ccccc2)CC1)Cn1ccc2ccccc12