Reaction Details
TargetKinesin-like protein KIF11
LigandBDBM50068393
Substrate/Competitorn/a
Meas. Tech.ChEMBL_1466497 (CHEMBL3406807)
EC50 205±n/a nM
Citation Mansoor, UFAngeles, ARDai, CYang, LVitharana, DBasso, ADGray, KTang, HLiu, MLiang, LAllbritton, OSiddiqui, MA Discovery of novel spiro 1,3,4-thiadiazolines as potent, orally bioavailable and brain penetrant KSP inhibitors. Bioorg Med Chem23:2424-34 (2015) 
 
Kinesin-like protein KIF11
Name:Kinesin-like protein KIF11
Type:PROTEIN
Mol. Mass.:119138.97
Organism:Homo sapiens (Human)
Description:ChEMBL_1457426
Residue:1056
BDBM50068393
NameBDBM50068393
Synonyms:CHEMBL3403383
TypeSmall organic molecule
Emp. Form.C20H19F2N3O2S
Mol. Mass.403.446
SMILESCC(=O)N1N=C(S[C@@]11[C@H](CCN)COc2ccccc12)c1cc(F)ccc1F