Reaction Details
TargetCoagulation factor VII
LigandBDBM50068983
Substrate/Competitorn/a
Meas. Tech.ChEMBL_1466580 (CHEMBL3407173)
Ki 6.1±n/a nM
Citation Glunz, PWCheng, XCheney, DLWeigelt, CAWei, ALuettgen, JMWong, PCWexler, RRPriestley, ES Design and synthesis of potent, selective phenylimidazole-based FVIIa inhibitors. Bioorg Med Chem Lett25:2169-73 (2015) 
 
Coagulation factor VII
Name:Coagulation factor VII
Type:Enzyme
Mol. Mass.:51599.89
Organism:Homo sapiens (Human)
Description:n/a
Residue:466
BDBM50068983
NameBDBM50068983
Synonyms:CHEMBL3400183
TypeSmall organic molecule
Emp. Form.C29H30FN5O4
Mol. Mass.531.578
SMILESCCOc1cc(OC(C)C)c(F)c(c1)C(Nc1ccc(cc1)C(N)=N)c1nc(c[nH]1)-c1ccccc1C(O)=O