Reaction Details
TargetCoagulation factor VII
LigandBDBM50068995
Substrate/Competitorn/a
Meas. Tech.ChEMBL_1466580 (CHEMBL3407173)
Ki 15±n/a nM
Citation Glunz, PWCheng, XCheney, DLWeigelt, CAWei, ALuettgen, JMWong, PCWexler, RRPriestley, ES Design and synthesis of potent, selective phenylimidazole-based FVIIa inhibitors. Bioorg Med Chem Lett25:2169-73 (2015) 
 
Coagulation factor VII
Name:Coagulation factor VII
Type:Enzyme
Mol. Mass.:51599.89
Organism:Homo sapiens (Human)
Description:n/a
Residue:466
BDBM50068995
NameBDBM50068995
Synonyms:CHEMBL3403468
TypeSmall organic molecule
Emp. Form.C29H32FN5O2
Mol. Mass.501.5951
SMILESCCOc1cc(OC(C)C)c(F)c(c1)C(Nc1ccc(cc1)C(N)=N)c1nc(cn1C)-c1ccccc1