Reaction Details
TargetTrypsin
LigandBDBM50068989
Substrate/Competitorn/a
Meas. Tech.ChEMBL_1466587 (CHEMBL3407180)
Ki 430±n/a nM
Citation Glunz, PWCheng, XCheney, DLWeigelt, CAWei, ALuettgen, JMWong, PCWexler, RRPriestley, ES Design and synthesis of potent, selective phenylimidazole-based FVIIa inhibitors. Bioorg Med Chem Lett25:2169-73 (2015) 
 
Trypsin
Name:Trypsin
Synonyms:Serine protease 1/Trypsin-2/Trypsin-3
Type:n/a
Mol. Mass.:n/a
Description:ASSAY_ID of ChEMBL is 2155713
Components:This complex has 3 components.
Component 1
Name:Serine protease 1
Type:Enzyme
Mol. Mass.:26557.80
Organism:Homo sapiens (Human)
Description:P07477
Residue:247
Component 2
Name:Trypsin-2
Synonyms:Anionic trypsinogen Serine protease 2 TRY2_HUMAN Thrombin & trypsin Trypsin II | Trypsin-2
Type:PROTEIN
Mol. Mass.:26479.43
Organism:Homo sapiens (Human)
Description:ChEMBL_41517
Residue:247
Component 3
Name:Trypsin-3
Synonyms:Brain trypsinogen PRSS3 Serine protease 3 TRY3 TRY4 Trypsin Trypsin IV | Trypsin-3
Type:PROTEIN
Mol. Mass.:32532.52
Organism:Homo sapiens (Human)
Description:ChEMBL_216043
Residue:304
BDBM50068989
NameBDBM50068989
Synonyms:CHEMBL3403474
TypeSmall organic molecule
Emp. Form.C29H32FN5O3
Mol. Mass.517.5945
SMILESCCOc1cc(OC(C)C)c(F)c(c1)C(Nc1ccc(cc1)C(N)=N)c1nc(c[nH]1)-c1ccccc1OC