Reaction Details
TargetCoagulation factor X
LigandBDBM50068989
Substrate/Competitorn/a
Meas. Tech.ChEMBL_1466586 (CHEMBL3407179)
Ki 460±n/a nM
Citation Glunz, PWCheng, XCheney, DLWeigelt, CAWei, ALuettgen, JMWong, PCWexler, RRPriestley, ES Design and synthesis of potent, selective phenylimidazole-based FVIIa inhibitors. Bioorg Med Chem Lett25:2169-73 (2015) 
 
Coagulation factor X
Name:Coagulation factor X
Type:Enzyme
Mol. Mass.:54726.60
Organism:Homo sapiens (Human)
Description:n/a
Residue:488
BDBM50068989
NameBDBM50068989
Synonyms:CHEMBL3403474
TypeSmall organic molecule
Emp. Form.C29H32FN5O3
Mol. Mass.517.5945
SMILESCCOc1cc(OC(C)C)c(F)c(c1)C(Nc1ccc(cc1)C(N)=N)c1nc(c[nH]1)-c1ccccc1OC