Reaction Details
TargetEpidermal growth factor receptor
LigandBDBM50069094
Substrate/Competitorn/a
Meas. Tech.ChEMBL_1466619 (CHEMBL3404061)
IC50 103±n/a nM
Citation Zhang, XRaghavan, SIhnat, MHamel, EZammiello, CBastian, AMooberry, SLGangjee, A The design, synthesis and biological evaluation of conformationally restricted 4-substituted-2,6-dimethylfuro[2,3-d]pyrimidines as multi-targeted receptor tyrosine kinase and microtubule inhibitors as potential antitumor agents. Bioorg Med Chem23:2408-23 (2015) 
 
Epidermal growth factor receptor
Name:Epidermal growth factor receptor
Type:Receptor Kinase Domain
Mol. Mass.:134279.59
Organism:Homo sapiens (Human)
Description:P00533
Residue:1210
BDBM50069094
NameBDBM50069094
Synonyms:CHEMBL3403515
TypeSmall organic molecule
Emp. Form.C17H17N3O2
Mol. Mass.295.3358
SMILESCOc1ccc2N(CCc2c1)c1nc(C)nc2oc(C)cc12