Reaction Details
TargetVascular endothelial growth factor receptor 2
LigandBDBM50069101
Substrate/Competitorn/a
Meas. Tech.ChEMBL_1466620 (CHEMBL3404062)
IC50>300±n/a nM
Citation Zhang, XRaghavan, SIhnat, MHamel, EZammiello, CBastian, AMooberry, SLGangjee, A The design, synthesis and biological evaluation of conformationally restricted 4-substituted-2,6-dimethylfuro[2,3-d]pyrimidines as multi-targeted receptor tyrosine kinase and microtubule inhibitors as potential antitumor agents. Bioorg Med Chem23:2408-23 (2015) 
 
Vascular endothelial growth factor receptor 2
Name:Vascular endothelial growth factor receptor 2
Type:Receptor Tyrosine Kinase
Mol. Mass.:151510.97
Organism:Homo sapiens (Human)
Description:P35968
Residue:1356
BDBM50069101
NameBDBM50069101
Synonyms:CHEMBL3403511 | US10189853, Compound 4
TypeSmall organic molecule
Emp. Form.C18H21N3O4
Mol. Mass.343.377
SMILESCOc1cc(cc(OC)c1OC)N(C)c1nc(C)nc2oc(C)cc12