Reaction Details
TargetPlatelet-derived growth factor receptor beta
LigandBDBM50069102
Substrate/Competitorn/a
Meas. Tech.ChEMBL_1466621 (CHEMBL3404063)
IC50 66±n/a nM
Citation Zhang, XRaghavan, SIhnat, MHamel, EZammiello, CBastian, AMooberry, SLGangjee, A The design, synthesis and biological evaluation of conformationally restricted 4-substituted-2,6-dimethylfuro[2,3-d]pyrimidines as multi-targeted receptor tyrosine kinase and microtubule inhibitors as potential antitumor agents. Bioorg Med Chem23:2408-23 (2015) 
 
Platelet-derived growth factor receptor beta
Name:Platelet-derived growth factor receptor beta
Type:Enzyme
Mol. Mass.:123922.25
Organism:Homo sapiens (Human)
Description:P09619
Residue:1106
BDBM50069102
NameBDBM50069102
Synonyms:CHEMBL3403510 | US10189853, Compound 3
TypeSmall organic molecule
Emp. Form.C17H19N3O3
Mol. Mass.313.3511
SMILESCOc1ccc(cc1OC)N(C)c1nc(C)nc2oc(C)cc12