Reaction Details
TargetVascular endothelial growth factor receptor 2
LigandBDBM50069102
Substrate/Competitorn/a
Meas. Tech.ChEMBL_1466620 (CHEMBL3404062)
IC50 19±n/a nM
Citation Zhang, XRaghavan, SIhnat, MHamel, EZammiello, CBastian, AMooberry, SLGangjee, A The design, synthesis and biological evaluation of conformationally restricted 4-substituted-2,6-dimethylfuro[2,3-d]pyrimidines as multi-targeted receptor tyrosine kinase and microtubule inhibitors as potential antitumor agents. Bioorg Med Chem23:2408-23 (2015) 
 
Vascular endothelial growth factor receptor 2
Name:Vascular endothelial growth factor receptor 2
Type:Receptor Tyrosine Kinase
Mol. Mass.:151510.97
Organism:Homo sapiens (Human)
Description:P35968
Residue:1356
BDBM50069102
NameBDBM50069102
Synonyms:CHEMBL3403510 | US10189853, Compound 3
TypeSmall organic molecule
Emp. Form.C17H19N3O3
Mol. Mass.313.3511
SMILESCOc1ccc(cc1OC)N(C)c1nc(C)nc2oc(C)cc12