Reaction Details
TargetTyrosine-protein phosphatase non-receptor type 1
LigandBDBM50069691
Substrate/Competitorn/a
Meas. Tech.ChEMBL_1466859 (CHEMBL3405965)
IC50 2.0±n/a nM
Citation Li, JLGao, LXMeng, FWTang, CLZhang, RJLi, JYLuo, CLi, JZhao, WM PTP1B inhibitors from stems of Angelica keiskei (Ashitaba). Bioorg Med Chem Lett25:2028-32 (2015) 
 
Tyrosine-protein phosphatase non-receptor type 1
Name:Tyrosine-protein phosphatase non-receptor type 1
Type:Protein phosphatase
Mol. Mass.:49963.76
Organism:Homo sapiens (Human)
Description:Human recombinant GST-fusion PTP1B (1-435).
Residue:435
BDBM50069691
NameBDBM50069691
Synonyms:Xanthoangelol | Xanthoangerol
TypeSmall organic molecule
Emp. Form.C25H28O3
Mol. Mass.376.488
SMILES[#6]\[#6](-[#6])=[#6]\[#6]-[#6]\[#6](-[#6])=[#6]\[#6]-c1c(-[#8])ccc(-[#6](=O)\[#6]=[#6]\c2ccccc2)c1-[#8]