Reaction Details
TargetE3 ubiquitin-protein ligase Mdm2
LigandBDBM50069781
Substrate/Competitorn/a
Meas. Tech.ChEMBL_1469499 (CHEMBL3412296)
IC50 0.520000±n/a nM
Citation Rew, YSun, DYan, XBeck, HPCanon, JChen, ADuquette, JEksterowicz, JFox, BMFu, JGonzalez, AZHouze, JHuang, XJiang, MJin, LLi, YLi, ZLing, YLo, MCLong, AMMcGee, LRMcIntosh, JOliner, JDOsgood, TSaiki, AYShaffer, PWang, YCWortman, SYakowec, PYe, QYu, DZhao, XZhou, JMedina, JCOlson, SH Discovery of AM-7209, a potent and selective 4-amidobenzoic acid inhibitor of the MDM2-p53 interaction. J Med Chem57:10499-511 (2014) 
 
E3 ubiquitin-protein ligase Mdm2
Name:E3 ubiquitin-protein ligase Mdm2
Type:Oncoprotein
Mol. Mass.:55196.54
Organism:Homo sapiens (Human)
Description:Q00987
Residue:491
BDBM50069781
NameBDBM50069781
Synonyms:CHEMBL3407572
TypeSmall organic molecule
Emp. Form.C34H42Cl2N2O6S
Mol. Mass.677.678
SMILESCC(C)(C)S(=O)(=O)C[C@H](C1CC1)N1[C@@H]([C@H](C[C@](C)(CC(=O)N[C@H]2C[C@@H](C2)C(O)=O)C1=O)c1cccc(Cl)c1)c1ccc(Cl)cc1