Reaction Details
TargetE3 ubiquitin-protein ligase Mdm2
LigandBDBM50069795
Substrate/Competitorn/a
Meas. Tech.ChEMBL_1469499 (CHEMBL3412296)
IC50 0.180000±n/a nM
Citation Rew, YSun, DYan, XBeck, HPCanon, JChen, ADuquette, JEksterowicz, JFox, BMFu, JGonzalez, AZHouze, JHuang, XJiang, MJin, LLi, YLi, ZLing, YLo, MCLong, AMMcGee, LRMcIntosh, JOliner, JDOsgood, TSaiki, AYShaffer, PWang, YCWortman, SYakowec, PYe, QYu, DZhao, XZhou, JMedina, JCOlson, SH Discovery of AM-7209, a potent and selective 4-amidobenzoic acid inhibitor of the MDM2-p53 interaction. J Med Chem57:10499-511 (2014) 
 
E3 ubiquitin-protein ligase Mdm2
Name:E3 ubiquitin-protein ligase Mdm2
Type:Oncoprotein
Mol. Mass.:55196.54
Organism:Homo sapiens (Human)
Description:Q00987
Residue:491
BDBM50069795
NameBDBM50069795
Synonyms:CHEMBL3407559
TypeSmall organic molecule
Emp. Form.C37H42Cl2N2O7S
Mol. Mass.729.71
SMILESCOc1cc(ccc1NC(=O)C[C@@]1(C)C[C@@H]([C@H](N([C@H](CS(=O)(=O)C(C)(C)C)C2CC2)C1=O)c1ccc(Cl)cc1)c1cccc(Cl)c1)C(O)=O