Reaction Details
TargetDelta-type opioid receptor
LigandBDBM50070379
Substrate/Competitorn/a
Meas. Tech.ChEMBL_1467482 (CHEMBL3411105)
IC50 0.330000±n/a nM
Citation Guillemyn, KKleczkowska, PLesniak, ADyniewicz, JVan der Poorten, OVan den Eynde, IKeresztes, AVarga, ELai, JPorreca, FChung, NNLemieux, CMika, JRojewska, EMakuch, WVan Duppen, JPrzewlocka, BVanden Broeck, JLipkowski, AWSchiller, PWTourwé, DBallet, S Synthesis and biological evaluation of compact, conformationally constrained bifunctional opioid agonist - neurokinin-1 antagonist peptidomimetics. Eur J Med Chem92:64-77 (2015) 
 
Delta-type opioid receptor
Name:Delta-type opioid receptor
Type:Enzyme Catalytic Domain
Mol. Mass.:40577.25
Organism:MOUSE
Description:P32300
Residue:372
BDBM50070379
NameBDBM50070379
Synonyms:CHEMBL3408521
TypeSmall organic molecule
Emp. Form.C38H49N7O6
Mol. Mass.699.839
SMILES[H][C@@]1(Cc2ccccc2CN(CCC(=O)N(C)Cc2ccccc2)C1=O)NC(=O)[C@@H](CCCNC(N)=O)NC(=O)[C@@H](N)Cc1c(C)cc(O)cc1C