Reaction Details
TargetSubstance-P receptor
LigandBDBM50070376
Substrate/Competitorn/a
Meas. Tech.ChEMBL_1467478 (CHEMBL3411101)
Ki 60±n/a nM
Citation Guillemyn, KKleczkowska, PLesniak, ADyniewicz, JVan der Poorten, OVan den Eynde, IKeresztes, AVarga, ELai, JPorreca, FChung, NNLemieux, CMika, JRojewska, EMakuch, WVan Duppen, JPrzewlocka, BVanden Broeck, JLipkowski, AWSchiller, PWTourwé, DBallet, S Synthesis and biological evaluation of compact, conformationally constrained bifunctional opioid agonist - neurokinin-1 antagonist peptidomimetics. Eur J Med Chem92:64-77 (2015) 
 
Substance-P receptor
Name:Substance-P receptor
Type:G Protein-Coupled Receptor (GPCR)
Mol. Mass.:46254.43
Organism:Homo sapiens (Human)
Description:P25103
Residue:407
BDBM50070376
NameBDBM50070376
Synonyms:CHEMBL3408518
TypeSmall organic molecule
Emp. Form.C40H48F6N8O5
Mol. Mass.834.8501
SMILES[H][C@@]1(Cc2ccccc2CN(CCC(=O)N(C)Cc2cc(cc(c2)C(F)(F)F)C(F)(F)F)C1=O)NC(=O)[C@@H](CCCNC(N)=N)NC(=O)[C@@H](N)Cc1c(C)cc(O)cc1C