Reaction Details
Target5-hydroxytryptamine receptor 1A
LigandBDBM21367
Substrate/Competitorn/a
Meas. Tech.ChEMBL_1468170 (CHEMBL3414155)
Ki 53±n/a nM
Citation Canale, VKurczab, RPartyka, ASatala, GWitek, JJastrzebska-Wiesek, MPawlowski, MBojarski, AJWesolowska, AZajdel, P Towards novel 5-HT7versus 5-HT1A receptor ligands among LCAPs with cyclic amino acid amide fragments: design, synthesis, and antidepressant properties. Part II. Eur J Med Chem92:202-11 (2015) 
 
5-hydroxytryptamine receptor 1A
Name:5-hydroxytryptamine receptor 1A
Type:n/a
Mol. Mass.:46122.49
Organism:Homo sapiens (Human)
Description:n/a
Residue:422
BDBM21367
NameBDBM21367
Synonyms:6-{4-[2-(methylsulfanyl)phenyl]piperazin-1-yl}-N-(1,2,3,4-tetrahydronaphthalen-1-yl)hexanamide LP-44 | Piperazinehexanamide derivative, 5
TypeSmall organic molecule
Emp. Form.C27H37N3OS
Mol. Mass.451.667
SMILESCSc1ccccc1N1CCN(CCCCCC(=O)NC2CCCc3ccccc23)CC1