Reaction Details
TargetBromodomain-containing protein 3
LigandBDBM50365463
Substrate/Competitorn/a
Meas. Tech.ChEMBL_1469308 (CHEMBL3414205)
IC50 400±n/a nM
Citation Zhao, LWang, YCao, DChen, TWang, QLi, YXu, YZhang, NWang, XChen, DChen, LChen, YLXia, GShi, ZLiu, YCLin, YMiao, ZShen, JXiong, B Fragment-based drug discovery of 2-thiazolidinones as BRD4 inhibitors: 2. Structure-based optimization. J Med Chem58:1281-97 (2015) 
 
Bromodomain-containing protein 3
Name:Bromodomain-containing protein 3
Type:Protein
Mol. Mass.:79571.81
Organism:Homo sapiens (Human)
Description:Q15059
Residue:726
BDBM50365463
NameBDBM50365463
Synonyms:CHEMBL1232461
TypeSmall organic molecule
Emp. Form.C22H22ClN5O2
Mol. Mass.423.895
SMILESCCNC(=O)C[C@@H]1N=C(c2ccc(Cl)cc2)c2cc(OC)ccc2-n2c(C)nnc12