Reaction Details
TargetBromodomain-containing protein 4
LigandBDBM50071108
Substrate/Competitorn/a
Meas. Tech.ChEMBL_1469310 (CHEMBL3414207)
IC50>100000±n/a nM
Citation Zhao, LWang, YCao, DChen, TWang, QLi, YXu, YZhang, NWang, XChen, DChen, LChen, YLXia, GShi, ZLiu, YCLin, YMiao, ZShen, JXiong, B Fragment-based drug discovery of 2-thiazolidinones as BRD4 inhibitors: 2. Structure-based optimization. J Med Chem58:1281-97 (2015) 
 
Bromodomain-containing protein 4
Name:Bromodomain-containing protein 4
Type:Protein
Mol. Mass.:152264.84
Organism:Homo sapiens (Human)
Description:O60885
Residue:1362
BDBM50071108
NameBDBM50071108
Synonyms:CHEMBL3409981
TypeSmall organic molecule
Emp. Form.C9H6FNOS
Mol. Mass.195.213
SMILESFc1ccccc1-c1csc(=O)[nH]1