Reaction Details
TargetBromodomain-containing protein 4
LigandBDBM50071203
Substrate/Competitorn/a
Meas. Tech.ChEMBL_1469310 (CHEMBL3414207)
IC50 220±n/a nM
Citation Zhao, LWang, YCao, DChen, TWang, QLi, YXu, YZhang, NWang, XChen, DChen, LChen, YLXia, GShi, ZLiu, YCLin, YMiao, ZShen, JXiong, B Fragment-based drug discovery of 2-thiazolidinones as BRD4 inhibitors: 2. Structure-based optimization. J Med Chem58:1281-97 (2015) 
 
Bromodomain-containing protein 4
Name:Bromodomain-containing protein 4
Type:Protein
Mol. Mass.:152264.84
Organism:Homo sapiens (Human)
Description:O60885
Residue:1362
BDBM50071203
NameBDBM50071203
Synonyms:CHEMBL3409992
TypeSmall organic molecule
Emp. Form.C15H18N2O3S2
Mol. Mass.338.445
SMILESCc1ccc(cc1S(=O)(=O)NC1CCCC1)-c1csc(=O)[nH]1