Reaction Details
TargetCannabinoid receptor 2
LigandBDBM50422834
Substrate/Competitorn/a
Meas. Tech.ChEMBL_1468240 (CHEMBL3411783)
Ki 0.480000±n/a nM
Citation Han, SZhang, FFQian, HYChen, LLPu, JBXie, XChen, JZ Design, syntheses, structure-activity relationships and docking studies of coumarin derivatives as novel selective ligands for the CB2 receptor. Eur J Med Chem93:16-32 (2015) 
 
Cannabinoid receptor 2
Name:Cannabinoid receptor 2
Type:G Protein-Coupled Receptor (GPCR)
Mol. Mass.:39690.94
Organism:Homo sapiens (Human)
Description:P34972
Residue:360
BDBM50422834
NameBDBM50422834
Synonyms:CHEMBL204387
TypeSmall organic molecule
Emp. Form.C24H28N2O5
Mol. Mass.424.4895
SMILESCCCCCOc1c(OC)ccc2cc(C(=O)NCCc3ccc(O)cc3)c(=O)[nH]c12