Reaction Details
TargetCannabinoid receptor 2
LigandBDBM50382740
Substrate/Competitorn/a
Meas. Tech.ChEMBL_1468240 (CHEMBL3411783)
Ki 107±n/a nM
Citation Han, SZhang, FFQian, HYChen, LLPu, JBXie, XChen, JZ Design, syntheses, structure-activity relationships and docking studies of coumarin derivatives as novel selective ligands for the CB2 receptor. Eur J Med Chem93:16-32 (2015) 
 
Cannabinoid receptor 2
Name:Cannabinoid receptor 2
Type:G Protein-Coupled Receptor (GPCR)
Mol. Mass.:39690.94
Organism:Homo sapiens (Human)
Description:P34972
Residue:360
BDBM50382740
NameBDBM50382740
Synonyms:CHEMBL2023574
TypeSmall organic molecule
Emp. Form.C26H32N2O4
Mol. Mass.436.5433
SMILESOC(=O)c1ccc(NC(=O)c2cc3CCCCCCc3n(CC3CCCCC3)c2=O)cc1