Reaction Details
TargetCannabinoid receptor 2
LigandBDBM50073019
Substrate/Competitorn/a
Meas. Tech.ChEMBL_1468236 (CHEMBL3411779)
EC50>10000±n/a nM
Citation Han, SZhang, FFQian, HYChen, LLPu, JBXie, XChen, JZ Design, syntheses, structure-activity relationships and docking studies of coumarin derivatives as novel selective ligands for the CB2 receptor. Eur J Med Chem93:16-32 (2015) 
 
Cannabinoid receptor 2
Name:Cannabinoid receptor 2
Type:G Protein-Coupled Receptor (GPCR)
Mol. Mass.:39690.94
Organism:Homo sapiens (Human)
Description:P34972
Residue:360
BDBM50073019
NameBDBM50073019
Synonyms:CHEMBL3410706
TypeSmall organic molecule
Emp. Form.C24H29NO4
Mol. Mass.395.4914
SMILESCCCCOc1cccc2cc(C(=O)NC34CC5CC(CC(C5)C3)C4)c(=O)oc12