Reaction Details
TargetCannabinoid receptor 1
LigandBDBM50073076
Substrate/Competitorn/a
Meas. Tech.ChEMBL_1468239 (CHEMBL3411782)
IC50>10000±n/a nM
Citation Han, SZhang, FFQian, HYChen, LLPu, JBXie, XChen, JZ Design, syntheses, structure-activity relationships and docking studies of coumarin derivatives as novel selective ligands for the CB2 receptor. Eur J Med Chem93:16-32 (2015) 
 
Cannabinoid receptor 1
Name:Cannabinoid receptor 1
Type:G Protein-Coupled Receptor (GPCR)
Mol. Mass.:52868.96
Organism:Homo sapiens (Human)
Description:P21554
Residue:472
BDBM50073076
NameBDBM50073076
Synonyms:CHEMBL3407533
TypeSmall organic molecule
Emp. Form.C18H21BrN2O5
Mol. Mass.425.274
SMILESCCCCOc1cc(Br)cc2cc(C(=O)NN3CCOCC3)c(=O)oc12