Reaction Details
TargetReverse transcriptase
LigandBDBM2483
Substrate/Competitorn/a
Meas. Tech.ChEMBL_1467610 (CHEMBL3411706)
IC50 12±n/a nM
Citation Meleddu, RDistinto, SCorona, ABianco, GCannas, VEsposito, FArtese, AAlcaro, SMatyus, PBogdan, DCottiglia, FTramontano, EMaccioni, E (3Z)-3-(2-[4-(aryl)-1,3-thiazol-2-yl]hydrazin-1-ylidene)-2,3-dihydro-1H-indol-2-one derivatives as dual inhibitors of HIV-1 reverse transcriptase. Eur J Med Chem93:452-60 (2015) 
 
Reverse transcriptase
Name:Reverse transcriptase
Synonyms:n/a
Type:Protein
Mol. Mass.:29598.37
Organism:Human immunodeficiency virus 1
Description:Q9WKE8
Residue:254
BDBM2483
NameBDBM2483
TypeSmall organic molecule
Emp. Form.C14H9ClF3NO2
Mol. Mass.315.675
SMILESFC(F)(F)[C@]1(OC(=O)Nc2ccc(Cl)cc12)C#CC1CC1