Reaction Details
TargetHistone-lysine N-methyltransferase EZH2
LigandBDBM50075054
Substrate/Competitorn/a
Meas. Tech.ChEMBL_1473211 (CHEMBL3418456)
IC50 13±n/a nM
Citation Kaniskan, HÜKonze, KDJin, J Selective inhibitors of protein methyltransferases. J Med Chem58:1596-629 (2015) 
 
Histone-lysine N-methyltransferase EZH2
Name:Histone-lysine N-methyltransferase EZH2
Type:Protein
Mol. Mass.:85367.84
Organism:Homo sapiens (Human)
Description:Q15910
Residue:746
BDBM50075054
NameBDBM50075054
Synonyms:CHEMBL3414574
TypeSmall organic molecule
Emp. Form.C23H26N4O2
Mol. Mass.390.4781
SMILESCCC(CC)n1ccc2c(cc(cc12)C#N)C(=O)NCc1c(C)cc(C)[nH]c1=O