Reaction Details
TargetHistone-arginine methyltransferase CARM1
LigandBDBM50075097
Substrate/Competitorn/a
Meas. Tech.ChEMBL_1473679 (CHEMBL3421465)
IC50 2600±n/a nM
Citation Kaniskan, HÜKonze, KDJin, J Selective inhibitors of protein methyltransferases. J Med Chem58:1596-629 (2015) 
 
Histone-arginine methyltransferase CARM1
Name:Histone-arginine methyltransferase CARM1
Type:Protein
Mol. Mass.:65855.47
Organism:Homo sapiens (Human)
Description:Q86X55
Residue:608
BDBM50075097
NameBDBM50075097
Synonyms:CHEMBL3414627
TypeSmall organic molecule
Emp. Form.C20H13Cl2N6NaO5S
Mol. Mass.543.315
SMILES[Na+].COc1ccc(cc1)\N=N\c1c(O)c2ccc(Nc3nc(Cl)nc(Cl)n3)cc2cc1S([O-])(=O)=O