Reaction Details
TargetHistone-lysine N-methyltransferase, H3 lysine-79 specific
LigandBDBM50075098
Substrate/Competitorn/a
Meas. Tech.ChEMBL_1473674 (CHEMBL3421243)
IC50 3.0±n/a nM
Citation Kaniskan, HÜKonze, KDJin, J Selective inhibitors of protein methyltransferases. J Med Chem58:1596-629 (2015) 
 
Histone-lysine N-methyltransferase, H3 lysine-79 specific
Name:Histone-lysine N-methyltransferase, H3 lysine-79 specific
Type:Protein
Mol. Mass.:184911.91
Organism:Homo sapiens (Human)
Description:Q8TEK3
Residue:1537
BDBM50075098
NameBDBM50075098
Synonyms:CHEMBL3414626 US9446064, A2
TypeSmall organic molecule
Emp. Form.C30H42N8O3
Mol. Mass.562.7063
SMILESCC(C)N(C[C@H]1O[C@H]([C@H](O)[C@@H]1O)n1cnc2c(N)ncnc12)[C@@H]1C[C@H](CCc2nc3cc(ccc3[nH]2)C(C)(C)C)C1