Reaction Details
TargetN-lysine methyltransferase KMT5A
LigandBDBM50106497
Substrate/Competitorn/a
Meas. Tech.ChEMBL_1473626 (CHEMBL3420965)
IC50 210±n/a nM
Citation Kaniskan, HÜKonze, KDJin, J Selective inhibitors of protein methyltransferases. J Med Chem58:1596-629 (2015) 
 
N-lysine methyltransferase KMT5A
Name:N-lysine methyltransferase KMT5A
Type:Enzyme
Mol. Mass.:42919.11
Organism:Homo sapiens (Human)
Description:Q9NQR1
Residue:393
BDBM50106497
NameBDBM50106497
Synonyms:6-Chloro-7-(2-morpholin-4-yl-ethylamino)-quinoline-5,8-dione CHEMBL337173 | NSC-663284
TypeSmall organic molecule
Emp. Form.C15H16ClN3O3
Mol. Mass.321.759
SMILESOc1c(Cl)c(N=CCN2CCOCC2)c(O)c2ncccc12