Reaction Details
TargetHistone-lysine N-methyltransferase SETD2
LigandBDBM50075101
Substrate/Competitorn/a
Meas. Tech.ChEMBL_1473620 (CHEMBL3420959)
IC50 800±n/a nM
Citation Kaniskan, HÜKonze, KDJin, J Selective inhibitors of protein methyltransferases. J Med Chem58:1596-629 (2015) 
 
Histone-lysine N-methyltransferase SETD2
Name:Histone-lysine N-methyltransferase SETD2
Type:Protein
Mol. Mass.:287574.77
Organism:Homo sapiens (Human)
Description:Q9BYW2
Residue:2564
BDBM50075101
NameBDBM50075101
Synonyms:CHEMBL3414624
TypeSmall organic molecule
Emp. Form.C18H29N7O5
Mol. Mass.423.4668
SMILESCCCN[C@@H](CC[C@H](N)C(O)=O)C[C@H]1O[C@H]([C@H](O)[C@@H]1O)n1cnc2c(N)ncnc12