Reaction Details
TargetN-lysine methyltransferase SMYD2
LigandBDBM50396022
Substrate/Competitorn/a
Meas. Tech.ChEMBL_1473597 (CHEMBL3420707)
IC50 120±n/a nM
Citation Kaniskan, HÜKonze, KDJin, J Selective inhibitors of protein methyltransferases. J Med Chem58:1596-629 (2015) 
 
N-lysine methyltransferase SMYD2
Name:N-lysine methyltransferase SMYD2
Type:Enzyme
Mol. Mass.:49689.57
Organism:Homo sapiens (Human)
Description:Q9NRG4
Residue:433
BDBM50396022
NameBDBM50396022
Synonyms:CHEMBL2169920
TypeSmall organic molecule
Emp. Form.C29H38Cl2N4O4
Mol. Mass.577.542
SMILESOc1ccc(CCNCCN(C2CCCCC2)C(=O)CCNCCc2ccc(Cl)c(Cl)c2)c2OCC(=O)Nc12