Reaction Details
TargetHistone-lysine N-methyltransferase SETD7
LigandBDBM50075073
Substrate/Competitorn/a
Meas. Tech.ChEMBL_1473578 (CHEMBL3420688)
IC50 2.0±n/a nM
Citation Kaniskan, HÜKonze, KDJin, J Selective inhibitors of protein methyltransferases. J Med Chem58:1596-629 (2015) 
 
Histone-lysine N-methyltransferase SETD7
Name:Histone-lysine N-methyltransferase SETD7
Type:Enzyme
Mol. Mass.:40691.12
Organism:Homo sapiens (Human)
Description:Q8WTS6
Residue:366
BDBM50075073
NameBDBM50075073
Synonyms:CHEMBL3414622
TypeSmall organic molecule
Emp. Form.C23H25F4N3O3S
Mol. Mass.499.522
SMILESFc1cc(cc2CCNCc12)S(=O)(=O)N[C@H](Cc1cccc(c1)C(F)(F)F)C(=O)N1CCCC1