Reaction Details
TargetMuscarinic acetylcholine receptor M1
LigandBDBM50075202
Substrate/Competitorn/a
Meas. Tech.ChEMBL_1473515 (CHEMBL3420198)
Kd 151±n/a nM
Citation Chen, XKlöckner, JHolze, JZimmermann, CSeemann, WKSchrage, RBock, AMohr, KTränkle, CHolzgrabe, UDecker, M Rational design of partial agonists for the muscarinic m1 acetylcholine receptor. J Med Chem58:560-76 (2015) 
 
Muscarinic acetylcholine receptor M1
Name:Muscarinic acetylcholine receptor M1
Type:Protein
Mol. Mass.:51442.54
Organism:Homo sapiens (Human)
Description:P11229
Residue:460
BDBM50075202
NameBDBM50075202
Synonyms:CHEMBL3414844
TypeSmall organic molecule
Emp. Form.C32H38BrFN4O4
Mol. Mass.641.571
SMILES[Br-].C[N+](C)(CCCCCCNC(=O)c1cn(Cc2ccccc2)c2ccc(F)cc2c1=O)CC#CCOC1=NOCC1