Reaction Details
TargetCholinesterase
LigandBDBM50075586
Substrate/Competitorn/a
Meas. Tech.ChEMBL_1473457 (CHEMBL3419739)
IC50 1865±n/a nM
Citation Guzior, NBajda, MSkrok, MKurpiewska, KLewinski, KBrus, BPi?lar, AKos, JGobec, SMalawska, B Development of multifunctional, heterodimeric isoindoline-1,3-dione derivatives as cholinesterase andß-amyloid aggregation inhibitors with neuroprotective properties. Eur J Med Chem92:738-49 (2015) 
 
Cholinesterase
Name:Cholinesterase
Type:Enzyme
Mol. Mass.:65643.35
Organism:Equus caballus (Horse)
Description:P81908
Residue:574
BDBM50075586
NameBDBM50075586
Synonyms:CHEMBL3415575
TypeSmall organic molecule
Emp. Form.C22H24F2N2O2
Mol. Mass.386.435
SMILESFc1ccc(CNCCCCCCCN2C(=O)c3ccccc3C2=O)c(F)c1