Reaction Details
TargetAcetylcholinesterase
LigandBDBM50075582
Substrate/Competitorn/a
Meas. Tech.ChEMBL_1473456 (CHEMBL3419738)
IC50 729±n/a nM
Citation Guzior, NBajda, MSkrok, MKurpiewska, KLewinski, KBrus, BPi?lar, AKos, JGobec, SMalawska, B Development of multifunctional, heterodimeric isoindoline-1,3-dione derivatives as cholinesterase andß-amyloid aggregation inhibitors with neuroprotective properties. Eur J Med Chem92:738-49 (2015) 
 
Acetylcholinesterase
Name:Acetylcholinesterase
Type:Enzyme
Mol. Mass.:71812.79
Organism:Electrophorus electricus (Electric eel)
Description:n/a
Residue:633
BDBM50075582
NameBDBM50075582
Synonyms:CHEMBL3415581
TypeSmall organic molecule
Emp. Form.C23H27ClN2O2
Mol. Mass.398.926
SMILESClc1cccc(CNCCCCCCCCN2C(=O)c3ccccc3C2=O)c1