Reaction Details
TargetAcetylcholinesterase
LigandBDBM50075587
Substrate/Competitorn/a
Meas. Tech.ChEMBL_1473456 (CHEMBL3419738)
IC50 229±n/a nM
Citation Guzior, NBajda, MSkrok, MKurpiewska, KLewinski, KBrus, BPi?lar, AKos, JGobec, SMalawska, B Development of multifunctional, heterodimeric isoindoline-1,3-dione derivatives as cholinesterase andß-amyloid aggregation inhibitors with neuroprotective properties. Eur J Med Chem92:738-49 (2015) 
 
Acetylcholinesterase
Name:Acetylcholinesterase
Type:Enzyme
Mol. Mass.:71812.79
Organism:Electrophorus electricus (Electric eel)
Description:n/a
Residue:633
BDBM50075587
NameBDBM50075587
Synonyms:CHEMBL3415574
TypeSmall organic molecule
Emp. Form.C21H22F2N2O2
Mol. Mass.372.4084
SMILESFc1ccc(CNCCCCCCN2C(=O)c3ccccc3C2=O)c(F)c1