Reaction Details
TargetAcetylcholinesterase
LigandBDBM50075589
Substrate/Competitorn/a
Meas. Tech.ChEMBL_1473456 (CHEMBL3419738)
IC50 361±n/a nM
Citation Guzior, NBajda, MSkrok, MKurpiewska, KLewinski, KBrus, BPi?lar, AKos, JGobec, SMalawska, B Development of multifunctional, heterodimeric isoindoline-1,3-dione derivatives as cholinesterase andß-amyloid aggregation inhibitors with neuroprotective properties. Eur J Med Chem92:738-49 (2015) 
 
Acetylcholinesterase
Name:Acetylcholinesterase
Type:Enzyme
Mol. Mass.:71812.79
Organism:Electrophorus electricus (Electric eel)
Description:n/a
Residue:633
BDBM50075589
NameBDBM50075589
Synonyms:CHEMBL3415570
TypeSmall organic molecule
Emp. Form.C22H25FN2O2
Mol. Mass.368.4445
SMILESFc1ccc(CNCCCCCCCN2C(=O)c3ccccc3C2=O)cc1