Reaction Details
TargetAcetylcholinesterase
LigandBDBM50075594
Substrate/Competitorn/a
Meas. Tech.ChEMBL_1473456 (CHEMBL3419738)
IC50 249±n/a nM
Citation Guzior, NBajda, MSkrok, MKurpiewska, KLewinski, KBrus, BPi?lar, AKos, JGobec, SMalawska, B Development of multifunctional, heterodimeric isoindoline-1,3-dione derivatives as cholinesterase andß-amyloid aggregation inhibitors with neuroprotective properties. Eur J Med Chem92:738-49 (2015) 
 
Acetylcholinesterase
Name:Acetylcholinesterase
Type:Enzyme
Mol. Mass.:71812.79
Organism:Electrophorus electricus (Electric eel)
Description:n/a
Residue:633
BDBM50075594
NameBDBM50075594
Synonyms:CHEMBL3415560
TypeSmall organic molecule
Emp. Form.C22H26N2O2
Mol. Mass.350.454
SMILESO=C1N(CCCCCCCNCc2ccccc2)C(=O)c2ccccc12