Reaction Details
TargetAcetylcholinesterase
LigandBDBM50075678
Substrate/Competitorn/a
Meas. Tech.ChEMBL_1473459 (CHEMBL3419741)
IC50 2105±n/a nM
Citation Guzior, NBajda, MSkrok, MKurpiewska, KLewinski, KBrus, BPi?lar, AKos, JGobec, SMalawska, B Development of multifunctional, heterodimeric isoindoline-1,3-dione derivatives as cholinesterase andß-amyloid aggregation inhibitors with neuroprotective properties. Eur J Med Chem92:738-49 (2015) 
 
Acetylcholinesterase
Name:Acetylcholinesterase
Type:Enzyme
Mol. Mass.:67792.70
Organism:Homo sapiens (Human)
Description:P22303
Residue:614
BDBM50075678
NameBDBM50075678
Synonyms:CHEMBL3415559
TypeSmall organic molecule
Emp. Form.C21H24N2O2
Mol. Mass.336.4275
SMILESO=C1N(CCCCCCNCc2ccccc2)C(=O)c2ccccc12