Reaction Details
TargetAcetylcholinesterase
LigandBDBM50075591
Substrate/Competitorn/a
Meas. Tech.ChEMBL_1473459 (CHEMBL3419741)
IC50 545±n/a nM
Citation Guzior, NBajda, MSkrok, MKurpiewska, KLewinski, KBrus, BPi?lar, AKos, JGobec, SMalawska, B Development of multifunctional, heterodimeric isoindoline-1,3-dione derivatives as cholinesterase andß-amyloid aggregation inhibitors with neuroprotective properties. Eur J Med Chem92:738-49 (2015) 
 
Acetylcholinesterase
Name:Acetylcholinesterase
Type:Enzyme
Mol. Mass.:67792.70
Organism:Homo sapiens (Human)
Description:P22303
Residue:614
BDBM50075591
NameBDBM50075591
Synonyms:CHEMBL3415566
TypeSmall organic molecule
Emp. Form.C23H27FN2O2
Mol. Mass.382.4711
SMILESFc1ccccc1CNCCCCCCCCN1C(=O)c2ccccc2C1=O