Reaction Details
TargetSTE20-like serine/threonine-protein kinase
LigandBDBM50076185
Substrate/Competitorn/a
Meas. Tech.ChEMBL_1473910 (CHEMBL3419161)
Kd 380±n/a nM
Citation Thoma, GSmith, ABvan Eis, MJVangrevelinghe, EBlanz, JAichholz, RLittlewood-Evans, ALee, CCLiu, HZerwes, HG Discovery and profiling of a selective and efficacious Syk inhibitor. J Med Chem58:1950-63 (2015) 
 
STE20-like serine/threonine-protein kinase
Name:STE20-like serine/threonine-protein kinase
Type:PROTEIN
Mol. Mass.:142644.38
Organism:Homo sapiens (Human)
Description:ChEMBL_1451342
Residue:1235
BDBM50076185
NameBDBM50076185
Synonyms:CHEMBL3416026 | US9290481, 1.1
TypeSmall organic molecule
Emp. Form.C18H22N8O
Mol. Mass.366.4203
SMILESN[C@H]1CCCC[C@H]1Nc1nnc(C(N)=O)c(Nc2cccc3cc[nH]c23)n1