Reaction Details
TargetTyrosine-protein kinase ZAP-70
LigandBDBM50076185
Substrate/Competitorn/a
Meas. Tech.ChEMBL_1473913 (CHEMBL3419164)
IC50 251±n/a nM
Citation Thoma, GSmith, ABvan Eis, MJVangrevelinghe, EBlanz, JAichholz, RLittlewood-Evans, ALee, CCLiu, HZerwes, HG Discovery and profiling of a selective and efficacious Syk inhibitor. J Med Chem58:1950-63 (2015) 
 
Tyrosine-protein kinase ZAP-70
Name:Tyrosine-protein kinase ZAP-70
Type:Enzyme
Mol. Mass.:69881.61
Organism:Homo sapiens (Human)
Description:ZAP-70 SH2 domain was expressed and purified from E. coli using O-phospho-L-tyrosine-agarose column.
Residue:619
BDBM50076185
NameBDBM50076185
Synonyms:CHEMBL3416026 | US9290481, 1.1
TypeSmall organic molecule
Emp. Form.C18H22N8O
Mol. Mass.366.4203
SMILESN[C@H]1CCCC[C@H]1Nc1nnc(C(N)=O)c(Nc2cccc3cc[nH]c23)n1