Reaction Details
TargetTyrosine-protein kinase SYK
LigandBDBM50076189
Substrate/Competitorn/a
Meas. Tech.ChEMBL_1473873 (CHEMBL3418950)
IC50 302±n/a nM
Citation Thoma, GSmith, ABvan Eis, MJVangrevelinghe, EBlanz, JAichholz, RLittlewood-Evans, ALee, CCLiu, HZerwes, HG Discovery and profiling of a selective and efficacious Syk inhibitor. J Med Chem58:1950-63 (2015) 
 
Tyrosine-protein kinase SYK
Name:Tyrosine-protein kinase SYK
Type:Enzyme
Mol. Mass.:72079.99
Organism:Homo sapiens (Human)
Description:P43405
Residue:635
BDBM50076189
NameBDBM50076189
Synonyms:CHEMBL3416024 | US9290481, 4.1
TypeSmall organic molecule
Emp. Form.C19H23N7O
Mol. Mass.365.4322
SMILESN[C@H]1CCCC[C@H]1Nc1cnc(C(N)=O)c(Nc2cccc3cc[nH]c23)n1