Reaction Details
TargetTyrosine-protein kinase SYK
LigandBDBM50076187
Substrate/Competitorn/a
Meas. Tech.ChEMBL_1473872 (CHEMBL3418949)
IC50 14±n/a nM
Citation Thoma, GSmith, ABvan Eis, MJVangrevelinghe, EBlanz, JAichholz, RLittlewood-Evans, ALee, CCLiu, HZerwes, HG Discovery and profiling of a selective and efficacious Syk inhibitor. J Med Chem58:1950-63 (2015) 
 
Tyrosine-protein kinase SYK
Name:Tyrosine-protein kinase SYK
Type:Enzyme
Mol. Mass.:72079.99
Organism:Homo sapiens (Human)
Description:P43405
Residue:635
BDBM50076187
NameBDBM50076187
Synonyms:CHEMBL3416027 | US9290481, 1.4
TypeSmall organic molecule
Emp. Form.C18H22N8O
Mol. Mass.366.4203
SMILESN[C@H]1CCCC[C@H]1Nc1nnc(C(N)=O)c(Nc2cccc3[nH]ccc23)n1