Reaction Details
TargetTyrosine-protein kinase SYK
LigandBDBM50076191
Substrate/Competitorn/a
Meas. Tech.ChEMBL_1473870 (CHEMBL3418947)
IC50 165±n/a nM
Citation Thoma, GSmith, ABvan Eis, MJVangrevelinghe, EBlanz, JAichholz, RLittlewood-Evans, ALee, CCLiu, HZerwes, HG Discovery and profiling of a selective and efficacious Syk inhibitor. J Med Chem58:1950-63 (2015) 
 
Tyrosine-protein kinase SYK
Name:Tyrosine-protein kinase SYK
Type:Enzyme
Mol. Mass.:72079.99
Organism:Homo sapiens (Human)
Description:P43405
Residue:635
BDBM50076191
NameBDBM50076191
Synonyms:CHEMBL3416022
TypeSmall organic molecule
Emp. Form.C20H24N6O
Mol. Mass.364.4442
SMILESN[C@H]1CCCC[C@H]1Nc1ccc(C(N)=O)c(Nc2cccc3cc[nH]c23)n1