Reaction Details
TargetVasopressin V1a receptor
LigandBDBM50077455
Substrate/Competitorn/a
Meas. Tech.ChEMBL_1473355 (CHEMBL3419315)
Ki 32±n/a nM
Citation Ratni, HRogers-Evans, MBissantz, CGrundschober, CMoreau, JLSchuler, FFischer, HAlvarez Sanchez, RSchnider, P Discovery of highly selective brain-penetrant vasopressin 1a antagonists for the potential treatment of autism via a chemogenomic and scaffold hopping approach. J Med Chem58:2275-89 (2015) 
 
Vasopressin V1a receptor
Name:Vasopressin V1a receptor
Type:Receptor
Mol. Mass.:46820.18
Organism:Homo sapiens (Human)
Description:P37288
Residue:418
BDBM50077455
NameBDBM50077455
Synonyms:CHEMBL3416877
TypeSmall organic molecule
Emp. Form.C21H18ClN3O3
Mol. Mass.395.839
SMILESClc1ccc2c(c[nH]c2c1)C(=O)N1CCC2(CC1)OC(=O)Nc1ccccc21