Reaction Details
TargetRAC-alpha serine/threonine-protein kinase
LigandBDBM50078208
Substrate/Competitorn/a
Meas. Tech.ChEMBL_1470553 (CHEMBL3419779)
Kd 350±n/a nM
Citation Yan, RChuang, HCKapuriya, NChou, CCLai, PTChang, HWYang, CNKulp, SKChen, CS Exploitation of the ability of¿-tocopherol to facilitate membrane co-localization of Akt and PHLPP1 to develop PHLPP1-targeted Akt inhibitors. J Med Chem58:2290-8 (2015) 
 
RAC-alpha serine/threonine-protein kinase
Name:RAC-alpha serine/threonine-protein kinase
Type:Enzyme
Mol. Mass.:55681.25
Organism:Homo sapiens (Human)
Description:P31749
Residue:480
BDBM50078208
NameBDBM50078208
Synonyms:CHEMBL3414687
TypeSmall organic molecule
Emp. Form.C16H24FNO3S
Mol. Mass.329.43
SMILESCC(C)CCCC1(C)CCc2cc(cc(F)c2O1)S(N)(=O)=O