Reaction Details
TargetRAC-alpha serine/threonine-protein kinase
LigandBDBM50078256
Substrate/Competitorn/a
Meas. Tech.ChEMBL_1470553 (CHEMBL3419779)
Kd 8500±n/a nM
Citation Yan, RChuang, HCKapuriya, NChou, CCLai, PTChang, HWYang, CNKulp, SKChen, CS Exploitation of the ability of¿-tocopherol to facilitate membrane co-localization of Akt and PHLPP1 to develop PHLPP1-targeted Akt inhibitors. J Med Chem58:2290-8 (2015) 
 
RAC-alpha serine/threonine-protein kinase
Name:RAC-alpha serine/threonine-protein kinase
Type:Enzyme
Mol. Mass.:55681.25
Organism:Homo sapiens (Human)
Description:P31749
Residue:480
BDBM50078256
NameBDBM50078256
Synonyms:CHEMBL3414671
TypeSmall organic molecule
Emp. Form.C19H30O2
Mol. Mass.290.4403
SMILESCOc1cc2CCC(C)(CCCC(C)C)Oc2c(C)c1C