Reaction Details
Target3-phosphoinositide-dependent protein kinase 1
LigandBDBM50078259
Substrate/Competitorn/a
Meas. Tech.ChEMBL_1470575 (CHEMBL3419801)
Kd 10200±n/a nM
Citation Yan, RChuang, HCKapuriya, NChou, CCLai, PTChang, HWYang, CNKulp, SKChen, CS Exploitation of the ability of¿-tocopherol to facilitate membrane co-localization of Akt and PHLPP1 to develop PHLPP1-targeted Akt inhibitors. J Med Chem58:2290-8 (2015) 
 
3-phosphoinositide-dependent protein kinase 1
Name:3-phosphoinositide-dependent protein kinase 1
Type:Enzyme
Mol. Mass.:63157.65
Organism:Homo sapiens (Human)
Description:O15530
Residue:556
BDBM50078259
NameBDBM50078259
Synonyms:CHEMBL3414669
TypeSmall organic molecule
Emp. Form.C18H28O2
Mol. Mass.276.4137
SMILESCC(C)CCC[C@]1(C)CCc2cc(O)c(C)c(C)c2O1